﻿"Dublin Core:Title","Dublin Core:Date","Dublin Core:Spatial Coverage","Dublin Core:Subject","Dublin Core:Abstract","Dublin Core:Language","Dublin Core:Type","Dublin Core:Source","Dublin Core:Creator","Dublin Core:Description","Dublin Core:Publisher","Dublin Core:Contributor","Dublin Core:Rights","Dublin Core:Relation","Dublin Core:Format","Dublin Core:Identifier","Dublin Core:Coverage","Dublin Core:Alternative Title","Dublin Core:Table Of Contents","Dublin Core:Date Available","Dublin Core:Date Created","Dublin Core:Date Accepted","Dublin Core:Date Copyrighted","Dublin Core:Date Submitted","Dublin Core:Date Issued","Dublin Core:Date Modified","Dublin Core:Date Valid","Dublin Core:Access Rights","Dublin Core:License","Dublin Core:Conforms To","Dublin Core:Has Format","Dublin Core:Has Part","Dublin Core:Has Version","Dublin Core:Is Format Of","Dublin Core:Is Part Of","Dublin Core:Is Referenced By","Dublin Core:Is Replaced By","Dublin Core:Is Required By","Dublin Core:Is Version Of","Dublin Core:References","Dublin Core:Replaces","Dublin Core:Requires","Dublin Core:Extent","Dublin Core:Medium","Dublin Core:Bibliographic Citation","Dublin Core:Temporal Coverage","Dublin Core:Accrual Method","Dublin Core:Accrual Periodicity","Dublin Core:Accrual Policy","Dublin Core:Audience","Dublin Core:Audience Education Level","Dublin Core:Mediator","Dublin Core:Instructional Method","Dublin Core:Provenance","Dublin Core:Rights Holder","Item Type Metadata:Text","Item Type Metadata:Location","Item Type Metadata:Transcription","Item Type Metadata:Local URL","Item Type Metadata:Original Format","Item Type Metadata:Physical Dimensions","Item Type Metadata:Duration","Item Type Metadata:Compression","Item Type Metadata:Producer","Item Type Metadata:Director","Item Type Metadata:Time Summary","Item Type Metadata:Email Body","Item Type Metadata:Subject Line","Item Type Metadata:From","Item Type Metadata:To","Item Type Metadata:Number of Attachments","Item Type Metadata:Standards","Item Type Metadata:Objectives","Item Type Metadata:Materials","Item Type Metadata:URL","Item Type Metadata:Event Type","Item Type Metadata:Participants","Item Type Metadata:Birth Date","Item Type Metadata:Birthplace","Item Type Metadata:Occupation","Item Type Metadata:Biographical Text","Item Type Metadata:Bibliography","Item Type Metadata:Sender","Item Type Metadata:Receiver","Item Type Metadata:Play Title","Item Type Metadata:Pages","Item Type Metadata:Notes","Item Type Metadata:Play Date","Item Type Metadata:Translated Title","Item Type Metadata:Author","Item Type Metadata:Theatrical organization","Item Type Metadata:Drama Title","Item Type Metadata:Translator","Item Type Metadata:Scenic designer","Item Type Metadata:Choreographer","Item Type Metadata:Direction of music","Item Type Metadata:Costume designer","Item Type Metadata:Cast","Item Type Metadata:Role distribution","Item Type Metadata:Artistic Contributors","Item Type Metadata:Photographer","Item Type Metadata:Music","Item Type Metadata:Conducting","Item Type Metadata:Chorus","Item Type Metadata:Translation","Item Type Metadata:Direction","Item Type Metadata:Scenography","Item Type Metadata:Costumes","Item Type Metadata:Choreography","Item Type Metadata:Chorus Grooming","Item Type Metadata:Leading of Chorus","Item Type Metadata:Place of performance","Item Type Metadata:Original Title","Item Type Metadata:Organization","Item Type Metadata:Illustrated",tags,file,itemType,collection,public,featured
"Για δυο εβδομάδες παραστάσεων αρχαίου δράματος: το Πειραϊκό στο Μπουένος Άυρες",21/81/968,Αθήνα,"Πειραϊκό Θέατρο^^Teatro Nacional Cervantes, Μπουένος Άιρες",,Ελληνικά,"Απόκομμα εφημερίδας","Τα Νέα",,"Σχόλιο / Είδηση",,,,,,,,,,,,,,,,,,,,,,,,,,,,,,,,,,,,,,,,,,,,,,,,,,,,,,,,,,,,,,,,,,,,,,,,,,,,,"Φάκελος: Κριτικές Ελληνικού Τύπου^^Περιοδεία στο Teatro Nacional Cervantes, Μπουένος Άιρες με 12 παραστάσεις",,,,,,,,,,,,,,,,,,,,,,,,,,,,,"Ευμενίδες,Ιππόλυτος,Ιφιγένεια εν Αυλίδι,Χοηφόροι",https://rondiris.piraeus.gov.gr/files/original/6404f3b57e276919eec606734df9fb34.jpg,"* Κριτικές/Αποκόμματα/ Αναφορές",Δημοσιεύματα,1,0
"Το ""Πειραϊκό"" εμφανίζεται απόψε στην Αργεντινή",21/8/1968,Αθήνα,"Πειραϊκό Θέατρο^^Teatro Nacional Cervantes, Μπουένος Άιρες^^Περιοδεία στη Νότιο Αμερική 1968",,Ελληνικά,"Απόκομμα εφημερίδας",Απογευματινή,,"Σχόλιο / Είδηση",,,,,,,,,,,,,,,,,,,,,,,,,,,,,,,,,,,,,,,,,,,,,,,,,,,,,,,,,,,,,,,,,,,,,,,,,,,,,"Φάκελος: Κριτικές Ελληνικού Τύπου^^Περιοδεία στο Teatro Nacional Cervantes, Μπουένος Άιρες με 12 παραστάσεις",,,,,,,,,,,,,,,,,,,,,,,,,,,,,"Ευμενίδες,Ιππόλυτος,Ιφιγένεια εν Αυλίδι,Χοηφόροι",https://rondiris.piraeus.gov.gr/files/original/e154776084f350a2183eb528d9d2bf4a.jpg,"* Κριτικές/Αποκόμματα/ Αναφορές",Δημοσιεύματα,1,0
"Έως 30 Αυγούστου ο θίασος Ροντήρη εις το Μπουένος Άιρες",25/8/1968,Αθήνα,"Πειραϊκό Θέατρο^^Teatro Nacional Cervantes, Μπουένος Άιρες^^Περιοδεία στη Νότιο Αμερική 1968",,Ελληνικά,"Απόκομμα εφημερίδας","Ελεύθερος Κόσμος",,"Σχόλιο / Είδηση",,,,,,,,,,,,,,,,,,,,,,,,,,,,,,,,,,,,,,,,,,,,,,,,,,,,,,,,,,,,,,,,,,,,,,,,,,,,,"Φάκελος: Κριτικές Ελληνικού Τύπου^^Περιοδεία στο Teatro Nacional Cervantes, Μπουένος Άιρες με 12 παραστάσεις",,,,,,,,,,,,,,,,,,,,,,,,,,,,,"Ευμενίδες,Ιππόλυτος,Ιφιγένεια εν Αυλίδι,Χοηφόροι",https://rondiris.piraeus.gov.gr/files/original/38406a414d3a14d59ba210a9a0c563b3.jpg,"* Κριτικές/Αποκόμματα/ Αναφορές",Δημοσιεύματα,1,0
"Θρίαμβος του Πειραϊκού στο Μπουένος Άιρες",31/8/1968,Θεσσαλονίκη,"Πειραϊκό Θέατρο^^Teatro Nacional Cervantes, Μπουένος Άιρες^^Περιοδεία στη Νότιο Αμερική 1968",,Ελληνικά,"Απόκομμα εφημερίδας","Ελληνικός Βορράς",,"Σχόλιο / Είδηση",,,,,,,,,,,,,,,,,,,,,,,,,,,,,,,,,,,,,,,,,,,,,,,,,,,,,,,,,,,,,,,,,,,,,,,,,,,,,"Φάκελος: Κριτικές Ελληνικού Τύπου^^Περιοδεία στο Teatro Nacional Cervantes, Μπουένος Άιρες με 12 παραστάσεις",,,,,,,,,,,,,,,,,,,,,,,,,,,,,"Ευμενίδες,Ιππόλυτος,Ιφιγένεια εν Αυλίδι,Χοηφόροι",https://rondiris.piraeus.gov.gr/files/original/6b13b376ec501dd619fbb488feca042b.jpg,"* Κριτικές/Αποκόμματα/ Αναφορές",Δημοσιεύματα,1,0
"Το ""Πειραϊκό"" στη Χιλή",31/8/1968,Αθήνα,"Πειραϊκό Θέατρο^^Teatro Nacional Cervantes, Μπουένος Άιρες^^Περιοδεία στη Νότιο Αμερική 1968",,Ελληνικά,"Απόκομμα εφημερίδας","Τα Νέα",,"Σχόλιο / Είδηση",,,,,,,,,,,,,,,,,,,,,,,,,,,,,,,,,,,,,,,,,,,,,,,,,,,,,,,,,,,,,,,,,,,,,,,,,,,,,"Φάκελος: Κριτικές Ελληνικού Τύπου^^Περιοδεία στο Teatro Nacional Cervantes, Μπουένος Άιρες με 12 παραστάσεις και περιοδεία στην Χιλή, 2/9/1968",,,,,,,,,,,,,,,,,,,,,,,,,,,,,Ιππόλυτος,https://rondiris.piraeus.gov.gr/files/original/21439d3e65247962b37bc5bc47ce8088.jpg,"* Κριτικές/Αποκόμματα/ Αναφορές",Δημοσιεύματα,1,0
"Ο θίασος Ροντήρη εις Χιλήν",31/8/1968,Αθήνα,"Πειραϊκό Θέατρο^^Περιοδεία στη Νότιο Αμερική 1968^^Teatro Nacional Cervantes, Μπουένος Άιρες",,Ελληνικά,"Απόκομμα εφημερίδας","Ελεύθερος Κόσμος",,"Σχόλιο / Είδηση",,,,,,,,,,,,,,,,,,,,,,,,,,,,,,,,,,,,,,,,,,,,,,,,,,,,,,,,,,,,,,,,,,,,,,,,,,,,,"Φάκελος: Κριτικές Ελληνικού Τύπου^^Περιοδεία στο Teatro Nacional Cervantes, Μπουένος Άιρες με 12 παραστάσεις και περιοδεία στην Χιλή, 2/9/1968",,,,,,,,,,,,,,,,,,,,,,,,,,,,,Ιππόλυτος,https://rondiris.piraeus.gov.gr/files/original/f58b715267eec95fc2ed12a333b648e4.jpg,"* Κριτικές/Αποκόμματα/ Αναφορές",Δημοσιεύματα,1,0
"Ολοκλήρωση περιοδείας στο Μπουένος Άιρες, Πειραϊκό Θέατρο, 1968",31/8/1968,Αθήνα,"Πειραϊκό Θέατρο^^Teatro Nacional Cervantes, Μπουένος Άιρες^^Περιοδεία στη Νότιο Αμερική 1968",,Ελληνικά,"Απόκομμα εφημερίδας",Βήμα,,"Σχόλιο / Είδηση",,,,,,,,,,,,,,,,,,,,,,,,,,,,,,,,,,,,,,,,,,,,,,,,,,,,,,,,,,,,,,,,,,,,,,,,,,,,,"Φάκελος: Κριτικές Ελληνικού Τύπου^^Περιοδεία στο Teatro Nacional Cervantes, Μπουένος Άιρες με 12 παραστάσεις και περιοδεία στην Χιλή, 2/9/1968",,,,,,,,,,,,,,,,,,,,,,,,,,,,,Ιππόλυτος,https://rondiris.piraeus.gov.gr/files/original/21d390cc16c0b783d4c792fe551659f0.jpg,"* Κριτικές/Αποκόμματα/ Αναφορές",Δημοσιεύματα,1,0
"Το Πειραϊκό συνεχίζει την περιοδείαν του στην Χιλή",31/8/1968,Αθήνα,"Πειραϊκό Θέατρο^^Περιοδεία στη Νότιο Αμερική 1968^^Teatro Nacional Cervantes, Μπουένος Άιρες",,Ελληνικά,"Απόκομμα εφημερίδας",Ακρόπολη,,"Σχόλιο / Είδηση",,,,,,,,,,,,,,,,,,,,,,,,,,,,,,,,,,,,,,,,,,,,,,,,,,,,,,,,,,,,,,,,,,,,,,,,,,,,,"Φάκελος: Κριτικές Ελληνικού Τύπου^^Περιοδεία στο Teatro Nacional Cervantes, Μπουένος Άιρες με 12 παραστάσεις και περιοδεία στην Χιλή, 2/9/1968",,,,,,,,,,,,,,,,,,,,,,,,,,,,,,https://rondiris.piraeus.gov.gr/files/original/ec934f1050d8bd777bccc20e28191bf7.jpg,"* Κριτικές/Αποκόμματα/ Αναφορές",Δημοσιεύματα,1,0
"Ολοκλήρωση περιοδείας στο Μπουένος Άιρες, Πειραϊκό Θέατρο, 1968",31/8/1968,Αθήνα,"Πειραϊκό Θέατρο^^Ροντήρης, Δημήτρης^^Teatro Nacional Cervantes, Μπουένος Άιρες^^Περιοδεία στη Νότιο Αμερική 1968",,Ελληνικά,"Απόκομμα εφημερίδας",Απογευματινή,,"Άρθρο εφημερίδας",,,,,,,,,,,,,,,,,,,,,,,,,,,,,,,,,,,,,,,,,,,,,,,,,,,,,,,,,,,,,,,,,,,,,,,,,,,,,"Φάκελος: Κριτικές Ελληνικού Τύπου^^Περιοδεία στο Teatro Nacional Cervantes, Μπουένος Άιρες με 12 παραστάσεις και περιοδεία στην Χιλή, 2/9/1968",,,,,,,,,,,,,,,,,,,,,,,,,,,,,Ιππόλυτος,https://rondiris.piraeus.gov.gr/files/original/ce5dd6ad0565f61b5187f800a29f40c6.jpg,"* Κριτικές/Αποκόμματα/ Αναφορές",Δημοσιεύματα,1,0
"Στην Χιλή το ""Πειραίκό Θέατρο""",2/9/1968,Θεσσαλονίκη,"Πειραϊκό Θέατρο^^Teatro Nacional Cervantes, Μπουένος Άιρες^^Περιοδεία στη Νότιο Αμερική 1968",,Ελληνικά,"Απόκομμα εφημερίδας",Θεσσαλονίκη,,"Σχόλιο / Είδηση",,,,,,,,,,,,,,,,,,,,,,,,,,,,,,,,,,,,,,,,,,,,,,,,,,,,,,,,,,,,,,,,,,,,,,,,,,,,,"Φάκελος: Κριτικές Ελληνικού Τύπου^^Περιοδεία στο Teatro Nacional Cervantes, Μπουένος Άιρες με 12 παραστάσεις και περιοδεία στην Χιλή, 2/9/1968",,,,,,,,,,,,,,,,,,,,,,,,,,,,,Ιππόλυτος,https://rondiris.piraeus.gov.gr/files/original/2e1b4c8f1cfda98f72be4d3c51d3fa51.jpg,"* Κριτικές/Αποκόμματα/ Αναφορές",Δημοσιεύματα,1,0
"Πειραϊκό Θέατρο, Μπουένος Άιρες, 1968",20/9/1968,Αθήνα,"Πειραϊκό Θέατρο^^Teatro Nacional Cervantes, Μπουένος Άιρες",,Ελληνικά,"Απόκομμα εφημερίδας",Απογευματινή,,"Σχόλιο / Είδηση",,,,,,,,,,,,,,,,,,,,,,,,,,,,,,,,,,,,,,,,,,,,,,,,,,,,,,,,,,,,,,,,,,,,,,,,,,,,,"Φάκελος: Κριτικές Ελληνικού Τύπου^^Απόκομμα χωρίς τίτλο^^Περιοδεία στο Teatro Nacional Cervantes, Μπουένος Άιρες με 12 παραστάσεις",,,,,,,,,,,,,,,,,,,,,,,,,,,,,,https://rondiris.piraeus.gov.gr/files/original/aaa490266e586e549f58fa73704a42c9.jpg,"* Κριτικές/Αποκόμματα/ Αναφορές",Δημοσιεύματα,1,0
