﻿"Dublin Core:Title","Dublin Core:Date","Dublin Core:Spatial Coverage","Dublin Core:Subject","Dublin Core:Abstract","Dublin Core:Language","Dublin Core:Type","Dublin Core:Source","Dublin Core:Creator","Dublin Core:Description","Dublin Core:Publisher","Dublin Core:Contributor","Dublin Core:Rights","Dublin Core:Relation","Dublin Core:Format","Dublin Core:Identifier","Dublin Core:Coverage","Dublin Core:Alternative Title","Dublin Core:Table Of Contents","Dublin Core:Date Available","Dublin Core:Date Created","Dublin Core:Date Accepted","Dublin Core:Date Copyrighted","Dublin Core:Date Submitted","Dublin Core:Date Issued","Dublin Core:Date Modified","Dublin Core:Date Valid","Dublin Core:Access Rights","Dublin Core:License","Dublin Core:Conforms To","Dublin Core:Has Format","Dublin Core:Has Part","Dublin Core:Has Version","Dublin Core:Is Format Of","Dublin Core:Is Part Of","Dublin Core:Is Referenced By","Dublin Core:Is Replaced By","Dublin Core:Is Required By","Dublin Core:Is Version Of","Dublin Core:References","Dublin Core:Replaces","Dublin Core:Requires","Dublin Core:Extent","Dublin Core:Medium","Dublin Core:Bibliographic Citation","Dublin Core:Temporal Coverage","Dublin Core:Accrual Method","Dublin Core:Accrual Periodicity","Dublin Core:Accrual Policy","Dublin Core:Audience","Dublin Core:Audience Education Level","Dublin Core:Mediator","Dublin Core:Instructional Method","Dublin Core:Provenance","Dublin Core:Rights Holder","Item Type Metadata:Text","Item Type Metadata:Location","Item Type Metadata:Transcription","Item Type Metadata:Local URL","Item Type Metadata:Original Format","Item Type Metadata:Physical Dimensions","Item Type Metadata:Duration","Item Type Metadata:Compression","Item Type Metadata:Producer","Item Type Metadata:Director","Item Type Metadata:Time Summary","Item Type Metadata:Email Body","Item Type Metadata:Subject Line","Item Type Metadata:From","Item Type Metadata:To","Item Type Metadata:Number of Attachments","Item Type Metadata:Standards","Item Type Metadata:Objectives","Item Type Metadata:Materials","Item Type Metadata:URL","Item Type Metadata:Event Type","Item Type Metadata:Participants","Item Type Metadata:Birth Date","Item Type Metadata:Birthplace","Item Type Metadata:Occupation","Item Type Metadata:Biographical Text","Item Type Metadata:Bibliography","Item Type Metadata:Sender","Item Type Metadata:Receiver","Item Type Metadata:Play Title","Item Type Metadata:Pages","Item Type Metadata:Notes","Item Type Metadata:Play Date","Item Type Metadata:Translated Title","Item Type Metadata:Author","Item Type Metadata:Theatrical organization","Item Type Metadata:Drama Title","Item Type Metadata:Translator","Item Type Metadata:Scenic designer","Item Type Metadata:Choreographer","Item Type Metadata:Direction of music","Item Type Metadata:Costume designer","Item Type Metadata:Cast","Item Type Metadata:Role distribution","Item Type Metadata:Artistic Contributors","Item Type Metadata:Photographer","Item Type Metadata:Music","Item Type Metadata:Conducting","Item Type Metadata:Chorus","Item Type Metadata:Translation","Item Type Metadata:Direction","Item Type Metadata:Scenography","Item Type Metadata:Costumes","Item Type Metadata:Choreography","Item Type Metadata:Chorus Grooming","Item Type Metadata:Leading of Chorus","Item Type Metadata:Place of performance","Item Type Metadata:Original Title","Item Type Metadata:Organization","Item Type Metadata:Illustrated",tags,file,itemType,collection,public,featured
"Θέατρο Κυβέλης",4/3/1951,Αθήνα,"Θέατρο Κυβέλης",,Ελληνικά,"Απόκομμα εφημερίδας",Ελευθερία,,"Σχόλιο / Είδηση",,,,,,,,,,,,,,,,,,,,,,,,,,,,,,,,,,,,,,,,,,,,,,,,,,,,,,,,,,,,,,,,,,,,,,,,,,,,,"Απόκομμα χωρίς τίτλο ",,,,,,,,,,,,,,,,,,,,,,,,,,,,,,https://rondiris.piraeus.gov.gr/files/original/86d2e6bef13a782adb89fc943d627799.jpg,"* Κριτικές/Αποκόμματα/ Αναφορές",Δημοσιεύματα,1,0
"Θέατρο Κυβέλης",26/2/1951,Αθήνα,"Θέατρο Κυβέλης^^Ελληνική Σκηνή^^Ανδρεάδη, Κατερίνα",,Ελληνικά,"Απόκομμα εφημερίδας",Ανεξαρτησία,,"Σχόλιο / Είδηση",,,,,,,,,,,,,,,,,,,,,,,,,,,,,,,,,,,,,,,,,,,,,,,,,,,,,,,,,,,,,,,,,,,,,,,,,,,,,"Απόκομμα χωρίς τίτλο ",,,,,,,,,,,,,,,,,,,,,,,,,,,,,,https://rondiris.piraeus.gov.gr/files/original/c85f837edbb6346abaa34db2a3f06c10.jpg,"* Κριτικές/Αποκόμματα/ Αναφορές",Δημοσιεύματα,1,0
"Θέατρο Κυβέλης",19/2/1951,Αθήνα,"Θέατρο Κυβέλης^^Ελληνική Σκηνή^^Ανδρεάδη, Κατερίνα",,Ελληνικά,"Απόκομμα εφημερίδας",Βραδυνή,,"Σχόλιο / Είδηση",,,,,,,,,,,,,,,,,,,,,,,,,,,,,,,,,,,,,,,,,,,,,,,,,,,,,,,,,,,,,,,,,,,,,,,,,,,,,"Στήλη : Θεατρικά^^Απόκομμα χωρίς τίτλο ",,,,,,,,,,,,,,,,,,,,,,,,,,,,,,https://rondiris.piraeus.gov.gr/files/original/5283af888b031718624a23161a6dbbf9.jpg,"* Κριτικές/Αποκόμματα/ Αναφορές",Δημοσιεύματα,1,0
"Θέατρο Κυβέλης",20/2/1951,Αθήνα,"Θέατρο Κυβέλης^^Ελληνική Σκηνή^^Ανδρεάδη, Κατερίνα",,Ελληνικά,"Απόκομμα εφημερίδας","Τα Νέα",,"Άρθρο εφημερίδας",,,,,,,,,,,,,,,,,,,,,,,,,,,,,,,,,,,,,,,,,,,,,,,,,,,,,,,,,,,,,,,,,,,,,,,,,,,,,"Απόκομμα χωρίς τίτλο ",,,,,,,,,,,,,,,,,,,,,,,,,,,,,,https://rondiris.piraeus.gov.gr/files/original/c9a789be8d3c8f6fd70e7b8588fb789b.jpg,"* Κριτικές/Αποκόμματα/ Αναφορές",Δημοσιεύματα,1,0
"Θέατρο Κυβέλης",21/2/1951,Αθήνα,"Θέατρο Κυβέλης^^Ροντήρης, Δημήτρης^^Οικονομικά^^Ανδρεάδη, Κατερίνα",,Ελληνικά,"Απόκομμα εφημερίδας",Έθνος,,"Άρθρο εφημερίδας",,,,,,,,,,,,,,,,,,,,,,,,,,,,,,,,,,,,,,,,,,,,,,,,,,,,,,,,,,,,,,,,,,,,,,,,,,,,,"Απόκομμα χωρίς τίτλο ",,,,,,,,,,,,,,,,,,,,,,,,,,,,,,https://rondiris.piraeus.gov.gr/files/original/4e26c6052cdca5a2f988d150c748f0b4.jpg,"* Κριτικές/Αποκόμματα/ Αναφορές",Δημοσιεύματα,1,0
"Ο ""Πειρασμός"" στο Θέατρο Κυβέλης",21/2/1951,Αθήνα,"Ελληνική Σκηνή^^Θέατρο Κυβέλης^^Ανδρεάδη, Κατερίνα",,Ελληνικά,"Απόκομμα εφημερίδας","Προοδευτικό Φιλελεύθερου",,"Σχόλιο / Είδηση",,,,,,,,,,,,,,,,,,,,,,,,,,,,,,,,,,,,,,,,,,,,,,,,,,,,,,,,,,,,,,,,,,,,,,,,,,,,,"Απόκομμα χωρίς τίτλο ",,,,,,,,,,,,,,,,,,,,,,,,,,,,,"Ο πειρασμός",https://rondiris.piraeus.gov.gr/files/original/37057fe38c0b65ae58bfe17af34c4d95.jpg,"* Κριτικές/Αποκόμματα/ Αναφορές",Δημοσιεύματα,1,0
"Θέατρο Κυβέλης",24/2/1951,Αθήνα,"Θέατρο Κυβέλης^^Ελληνική Σκηνή^^Ανδρεάδη, Κατερίνα",,Ελληνικά,"Απόκομμα εφημερίδας","Τα Νέα",,"Σχόλιο / Είδηση",,,,,,,,,,,,,,,,,,,,,,,,,,,,,,,,,,,,,,,,,,,,,,,,,,,,,,,,,,,,,,,,,,,,,,,,,,,,,"Απόκομμα χωρίς τίτλο ",,,,,,,,,,,,,,,,,,,,,,,,,,,,,,https://rondiris.piraeus.gov.gr/files/original/fc4c6223f48004612aaede007e2de123.jpg,"* Κριτικές/Αποκόμματα/ Αναφορές",Δημοσιεύματα,1,0
"Ελληνική Σκηνή περιοδεία, 1951",12/2/1951,Αθήνα,"Ελληνική Σκηνή^^Θέατρο Κυβέλης",,Ελληνικά,"Απόκομμα εφημερίδας",Ανεξαρτησία,,"Σχόλιο / Είδηση",,,,,,,,,,,,,,,,,,,,,,,,,,,,,,,,,,,,,,,,,,,,,,,,,,,,,,,,,,,,,,,,,,,,,,,,,,,,,"Απόκομμα χωρίς τίτλο ",,,,,,,,,,,,,,,,,,,,,,,,,,,,,,https://rondiris.piraeus.gov.gr/files/original/f5241ebc6e850f8c2fd4f6bf5e665ea5.jpg,"* Κριτικές/Αποκόμματα/ Αναφορές",Δημοσιεύματα,1,0
